BDBM101639 US8530652, 84
SMILES Cc1nc(Nc2[nH]nc3c2CN(C(=O)NC2C[C@H]2c2ccccc2)C3(C)C)c2ccccc2n1
InChI Key InChIKey=UCDNJCAQEUFACH-YMXDCFFPSA-N
Data  1 KI  1 EC50
  Tab Delimited (TSV)   2D SDfile   Computed 3D by Vconf -m prep SDfile
Find this compound or compounds like it in BindingDB:
Activity Spreadsheet -- Enzyme Inhibition Constant Data from BindingDB
Found 1 hit for monomerid = 101639
TargetSerine/threonine-protein kinase PAK 4(Homo sapiens (Human))
Agouron Pharmaceuticals
US Patent
LigandPNGBDBM101639(US8530652, 84)
Affinity DataKi:  34nM EC50:  455nM. Assay description: The enzymatic activity of PAK4 KD was measured by its ability to catalyzed the transfer of a phosphate residue from a nucleoside triphosphate to an a...
In DepthDetails US Patent